Search
Submitted (UTC) Testcase Outcome Item Note Details Groups Logs
2017-02-06 16:48:33.079538 compose.upgrade_2_server_64bit FAILED Fedora-Rawhide-20170206.n.0 _console_wait_login module failed Details In 3 groups → Link →
2017-02-06 16:47:08.976044 compose.upgrade_2_minimal_64bit FAILED Fedora-Rawhide-20170206.n.0 _console_wait_login module failed Details In 3 groups → Link →
2017-02-06 15:53:37.754875 compose.upgrade_server_64bit FAILED Fedora-Rawhide-20170206.n.0 _console_wait_login module failed Details In 3 groups → Link →
2017-02-06 15:50:45.726782 compose.upgrade_minimal_64bit FAILED Fedora-Rawhide-20170206.n.0 _console_wait_login module failed Details In 3 groups → Link →
2017-02-06 15:31:57.560307 compose.install_package_set_kde PASSED Fedora-Server-dvd-i386-Rawhide-20170206.n.0.iso Details In 5 groups → Link →
2017-02-06 15:25:13.379862 compose.upgrade_2_desktop_encrypted_64bit PASSED Fedora-Rawhide-20170206.n.0 Details In 3 groups → Link →
2017-02-06 15:24:02.548815 compose.upgrade_2_desktop_32bit PASSED Fedora-Rawhide-20170206.n.0 Details In 3 groups → Link →
2017-02-06 15:16:48.246324 compose.upgrade_2_desktop_64bit PASSED Fedora-Rawhide-20170206.n.0 Details In 3 groups → Link →
2017-02-06 15:16:45.717730 compose.install_package_set_kde PASSED Fedora-Server-dvd-x86_64-Rawhide-20170206.n.0.iso Details In 5 groups → Link →
2017-02-06 15:13:04.040315 compose.install_no_swap FAILED Fedora-Server-dvd-x86_64-Rawhide-20170206.n.0.iso _console_wait_login module failed Details In 5 groups → Link →
2017-02-06 15:09:39.659521 compose.install_no_swap FAILED Fedora-Server-dvd-x86_64-Rawhide-20170206.n.0.iso _console_wait_login module failed Details In 5 groups → Link →
2017-02-06 15:09:24.728074 compose.install_ext3 FAILED Fedora-Server-dvd-i386-Rawhide-20170206.n.0.iso _console_wait_login module failed Details In 5 groups → Link →
2017-02-06 15:09:05.536832 compose.install_lvmthin FAILED Fedora-Server-dvd-i386-Rawhide-20170206.n.0.iso _console_wait_login module failed Details In 5 groups → Link →
2017-02-06 15:04:29.205257 compose.upgrade_2_kde_64bit FAILED Fedora-Rawhide-20170206.n.0 upgrade_run module failed Details In 3 groups → Link →
2017-02-06 15:04:18.569468 compose.install_btrfs FAILED Fedora-Server-dvd-i386-Rawhide-20170206.n.0.iso _console_wait_login module failed Details In 5 groups → Link →
2017-02-06 15:02:21.258109 compose.base_services_start FAILED Fedora-KDE-Live-x86_64-Rawhide-20170206.n.0.iso _graphical_wait_login module failed Details In 5 groups → Link →
2017-02-06 14:59:58.828675 compose.install_asian_language FAILED Fedora-Server-dvd-x86_64-Rawhide-20170206.n.0.iso _boot_to_anaconda module failed Details In 5 groups → Link →
2017-02-06 14:59:01.263071 compose.install_lvmthin FAILED Fedora-Server-dvd-x86_64-Rawhide-20170206.n.0.iso _console_wait_login module failed Details In 5 groups → Link →
2017-02-06 14:58:35.555813 compose.install_european_language PASSED Fedora-Server-dvd-x86_64-Rawhide-20170206.n.0.iso Details In 5 groups → Link →
2017-02-06 14:57:48.377578 compose.install_btrfs FAILED Fedora-Server-dvd-x86_64-Rawhide-20170206.n.0.iso _console_wait_login module failed Details In 5 groups → Link →
"